{"text_format":"1","workbook":"xlsx","n_sheets":6,"sheets":["Data","Countries","First_Names","Gen_Corr_Target_Corr","Gen_Corr_Input_Series","Gen_Corr_Output_Series"],"not_rendered":{"charts":0,"images":0,"macros":1,"external_links":0,"defined_names":2,"comments":0,"pivot_tables":0},"unopened":[],"bounds":{"document_bytes":16777216,"sheet_cells":100000,"rows_first":2000,"rows_last":500,"rows_between":2000,"halvings":0,"cell_chars":16384,"cell_head_chars":4096},"cells_cut":0,"cells_raw":0,"read":"whole","date_system":"1900"}

{"sheet":"Data","index":0,"n_rows":70,"n_cols":10,"rows_kept":70,"cut":false,"hidden":false,"merged":[]}
["Test Input 1","Test Input 2","Test Result","Correct Result"," ","Test Data Generator",null,"Input 1","Input 2","Explanation"]
[20,"Malaysia","Test formulas go here","Cross check formulas"," "]
[277,"Cambodia",null,null," ","Number of test records",null,25,20]
[22,"United Arab Emirates",null,null," ","Shuffle after generation",null,true,false,"Perform a random shuffle after data generation"]
[20,"Kuwait",null,null," ","Data type"]
[20,"Timor-Leste",null,null," ","Boolean",null,null,null,"Weight across data types"]
[29,"Montenegro",null,null," ",null,"True",1,1,"Weight within Boolean data type"]
[20,"Norway",null,null," ",null,"False",1,1,"Weight within Boolean data type"]
[20,"Romania",null,null," ","Currency",null,null,null,"Weight across data types"]
[20,"Russian Federation",null,null," ",null,"Min",10,null,"Choose either Min and Max ..."]
[20,"Albania",null,null," ",null,"Max",20]
[20,"Spain",null,null," ",null,"Avg",null,6,"... or Avg and StDev"]
[20,"Denmark",null,null," ",null,"StDev",null,2]
[27,"Bosnia and Herzegovina",null,null," ","Date",null,null,null,"Weight across data types"]
[21,"Greece",null,null," ",null,"Min","2000-01-01",null,"Choose either Min and Max ..."]
[20,"Belarus",null,null," ",null,"Max","2013-01-01"]
[20,"Egypt",null,null," ",null,"Avg",null,"2022-01-25","... or Avg and StDev"]
[21,"Swaziland",null,null," ",null,"StDev",null,180]
[20,"Tunisia",null,null," ","Decimal",null,null,null,"Weight across data types"]
[20,"Guinea-Bissau",null,null," ",null,"Min",null,null,"Choose either Min and Max ..."]
[20,"Morocco",null,null," ",null,"Max"]
[214,null,null,null," ",null,"Avg",5,100,"... or Avg and StDev"]
[49,null,null,null," ",null,"StDev",5,50]
[20,null,null,null," ","Double",null,null,null,"Weight across data types"]
[20,null,null,null," ",null,"Min",null,null,"Choose either Min and Max ..."]
[20,null,null,null," ",null,"Max"]
[null,null,null,null," ",null,"Avg",5,100,"... or Avg and StDev"]
[null,null,null,null," ",null,"StDev",1,50]
[null,null,null,null," ","Long",null,1,null,"Weight across data types"]
[null,null,null,null,null,null,"Sum",1000,1000,"Choose either Sum of integers ..."]
[null,null,null,null,null,null,"Min",20,20,"of this minimal value"]
[null,null,null,null," ",null,"Min",null,null,"... or Min, Max and MaxRepeat"]
[null,null,null,null," ",null,"Max",6,6]
[null,null,null,null," ",null,"MaxRepeat",1,1,"1 = Unique numbers, [empty] = any"]
[null,null,null,null," ","String",null,null,1,"Weight across data types"]
[null,null,null,null," ",null,"Length",null,null,"Either a simple string ..."]
[null,null,null,null," ",null,"Min","A","a","\"A\" or \"a\""]
[null,null,null,null," ",null,"Max","Z","z","\"Z\" or \"z\""]
[null,null,null,null," ",null,"NextTabRepeat",null,null,"... or an item from next tab ... First define how often each item might occur"]
[null,null,null,null," ",null,"NextTabColumn",1,1,"Column of items in next tab"]
[null,null,null,null," ",null,"NextTabItemRepeat",1,1,"... or an item from weighted item groups"]
[null,null,null,null," ",null,"NextTabItemColumn",1,1,"Column of items in next tab"]
[null,null,null,null," ",null,"NextTabGroupColumn",2,2,"Column of item groups in next tab"]
[null,null,null,null," ",null,"Asia",null,1,"List item groups on the left and then their weights"]
[null,null,null,null," ",null,"Europe",1,2]
[null,null,null,null," ",null,"Africa",null,1]
[null,null,null,null," ",null,"Oceania"]
[null,null,null,null," ",null,"North America"]
[null,null,null,null," ",null,"Antarctica"]
[null,null,null,null," ",null,"South America"]
[null,null,null,null," "]
[null,null,null,null," "]
[null,null,null,null," "]
[null,null,null,null," "]
[null,null,null,null," "]
[null,null,null,null," "]
[null,null,null,null," "]
[null,null,null,null," "]
[null,null,null,null," "]
[null,null,null,null," "]
[null,null,null,null," "]
[null,null,null,null," "]
[null,null,null,null," "]
[null,null,null,null," "]
[null,null,null,null," "]
[null,null,null,null," "]
[null,null,null,null," "]
[null,null,null,null," "]
[null,null,null,null," "]
[null,null,null,null," "]

{"sheet":"Countries","index":1,"n_rows":250,"n_cols":4,"rows_kept":250,"cut":false,"hidden":false,"merged":[]}
["Country Name","Continent Name","Source:","https://raw.github.com/wikimedia/limn-data/master/geo/country-codes.csv"]
["Afghanistan","Asia"]
["Åland","Europe"]
["Albania","Europe"]
["Algeria","Africa"]
["American Samoa","Oceania"]
["Andorra","Europe"]
["Angola","Africa"]
["Anguilla","North America"]
["Antarctica","Antarctica"]
["Antigua and Barbuda","North America"]
["Argentina","South America"]
["Armenia","Asia"]
["Aruba","North America"]
["Australia","Oceania"]
["Austria","Europe"]
["Azerbaijan","Asia"]
["Bahamas","North America"]
["Bahrain","Asia"]
["Bangladesh","Asia"]
["Barbados","North America"]
["Belarus","Europe"]
["Belgium","Europe"]
["Belize","North America"]
["Benin","Africa"]
["Bermuda","North America"]
["Bhutan","Asia"]
["Bolivia","South America"]
["Bonaire, Sint Eustatiusand Saba","North America"]
["Bosnia and Herzegovina","Europe"]
["Botswana","Africa"]
["Bouvet Island","Antarctica"]
["Brazil","South America"]
["British Indian Ocean Territory","Asia"]
["Brunei Darussalam","Asia"]
["Bulgaria","Europe"]
["Burkina Faso","Africa"]
["Burundi","Africa"]
["Cambodia","Asia"]
["Cameroon","Africa"]
["Canada","North America"]
["Cape Verde","Africa"]
["Cayman Islands","North America"]
["Central African Republic","Africa"]
["Chad","Africa"]
["Chile","South America"]
["China","Asia"]
["Christmas Island","Asia"]
["Cocos (Keeling) Islands","Asia"]
["Colombia","South America"]
["Comoros","Africa"]
["Congo (Brazzaville)","Africa"]
["Congo (Kinshasa)","Africa"]
["Cook Islands","Oceania"]
["Costa Rica","North America"]
["Côte d'Ivoire","Africa"]
["Croatia","Europe"]
["Cuba","North America"]
["Curaçao","North America"]
["Cyprus","Asia"]
["Czech Republic","Europe"]
["Denmark","Europe"]
["Djibouti","Africa"]
["Dominica","North America"]
["Dominican Republic","North America"]
["Ecuador","South America"]
["Egypt","Africa"]
["El Salvador","North America"]
["Equatorial Guinea","Africa"]
["Eritrea","Africa"]
["Estonia","Europe"]
["Ethiopia","Africa"]
["Falkland Islands","South America"]
["Faroe Islands","Europe"]
["Fiji","Oceania"]
["Finland","Europe"]
["France","Europe"]
["French Guiana","South America"]
["French Polynesia","Oceania"]
["French Southern Lands","Antarctica"]
["Gabon","Africa"]
["Gambia","Africa"]
["Georgia","Asia"]
["Germany","Europe"]
["Ghana","Africa"]
["Gibraltar","Europe"]
["Greece","Europe"]
["Greenland","North America"]
["Grenada","North America"]
["Guadeloupe","North America"]
["Guam","Oceania"]
["Guatemala","North America"]
["Guernsey","Europe"]
["Guinea","Africa"]
["Guinea-Bissau","Africa"]
["Guyana","South America"]
["Haiti","North America"]
["Heard and McDonald Islands","Antarctica"]
["Honduras","North America"]
["Hong Kong","Asia"]
["Hungary","Europe"]
["Iceland","Europe"]
["India","Asia"]
["Indonesia","Asia"]
["Iran","Asia"]
["Iraq","Asia"]
["Ireland","Europe"]
["Isle of Man","Europe"]
["Israel","Asia"]
["Italy","Europe"]
["Jamaica","North America"]
["Japan","Asia"]
["Jersey","Europe"]
["Jordan","Asia"]
["Kazakhstan","Asia"]
["Kenya","Africa"]
["Kiribati","Oceania"]
["Korea, North","Asia"]
["Korea, South","Asia"]
["Kuwait","Asia"]
["Kyrgyzstan","Asia"]
["Laos","Asia"]
["Latvia","Europe"]
["Lebanon","Asia"]
["Lesotho","Africa"]
["Liberia","Africa"]
["Libya","Africa"]
["Liechtenstein","Europe"]
["Lithuania","Europe"]
["Luxembourg","Europe"]
["Macau","Asia"]
["Macedonia","Europe"]
["Madagascar","Africa"]
["Malawi","Africa"]
["Malaysia","Asia"]
["Maldives","Asia"]
["Mali","Africa"]
["Malta","Europe"]
["Marshall Islands","Oceania"]
["Martinique","North America"]
["Mauritania","Africa"]
["Mauritius","Africa"]
["Mayotte","Africa"]
["Mexico","North America"]
["Micronesia","Oceania"]
["Moldova","Europe"]
["Monaco","Europe"]
["Mongolia","Asia"]
["Montenegro","Europe"]
["Montserrat","North America"]
["Morocco","Africa"]
["Mozambique","Africa"]
["Myanmar","Asia"]
["Namibia","Africa"]
["Nauru","Oceania"]
["Nepal","Asia"]
["Netherlands","Europe"]
["New Caledonia","Oceania"]
["New Zealand","Oceania"]
["Nicaragua","North America"]
["Niger","Africa"]
["Nigeria","Africa"]
["Niue","Oceania"]
["Norfolk Island","Oceania"]
["Northern Mariana Islands","Oceania"]
["Norway","Europe"]
["Oman","Asia"]
["Pakistan","Asia"]
["Palau","Oceania"]
["Palestine","Asia"]
["Panama","North America"]
["Papua New Guinea","Oceania"]
["Paraguay","South America"]
["Peru","South America"]
["Philippines","Asia"]
["Pitcairn","Oceania"]
["Poland","Europe"]
["Portugal","Europe"]
["Puerto Rico","North America"]
["Qatar","Asia"]
["Reunion","Africa"]
["Romania","Europe"]
["Russian Federation","Europe"]
["Rwanda","Africa"]
["Saint Barthélemy","North America"]
["Saint Helena","Africa"]
["Saint Kitts and Nevis","North America"]
["Saint Lucia","North America"]
["Saint Martin (French part)","North America"]
["Saint Pierre and Miquelon","North America"]
["Saint Vincent and the Grenadines","North America"]
["Samoa","Oceania"]
["San Marino","Europe"]
["Sao Tome and Principe","Africa"]
["Saudi Arabia","Asia"]
["Senegal","Africa"]
["Serbia","Europe"]
["Seychelles","Africa"]
["Sierra Leone","Africa"]
["Singapore","Asia"]
["Sint Maarten","North America"]
["Slovakia","Europe"]
["Slovenia","Europe"]
["Solomon Islands","Oceania"]
["Somalia","Africa"]
["South Africa","Africa"]
["South Georgia and South Sandwich Islands","Antarctica"]
["South Sudan","Africa"]
["Spain","Europe"]
["Sri Lanka","Asia"]
["Sudan","Africa"]
["Suriname","South America"]
["Svalbard and Jan Mayen Islands","Europe"]
["Swaziland","Africa"]
["Sweden","Europe"]
["Switzerland","Europe"]
["Syria","Asia"]
["Taiwan","Asia"]
["Tajikistan","Asia"]
["Tanzania","Africa"]
["Thailand","Asia"]
["Timor-Leste","Asia"]
["Togo","Africa"]
["Tokelau","Oceania"]
["Tonga","Oceania"]
["Trinidad and Tobago","North America"]
["Tunisia","Africa"]
["Turkey","Asia"]
["Turkmenistan","Asia"]
["Turks and Caicos Islands","North America"]
["Tuvalu","Oceania"]
["Uganda","Africa"]
["Ukraine","Europe"]
["United Arab Emirates","Asia"]
["United Kingdom","Europe"]
["United States Minor Outlying Islands","Oceania"]
["United States of America","North America"]
["Uruguay","South America"]
["Uzbekistan","Asia"]
["Vanuatu","Oceania"]
["Vatican City","Europe"]
["Venezuela","South America"]
["Vietnam","Asia"]
["Virgin Islands, British","North America"]
["Virgin Islands, U.S.","North America"]
["Wallis and Futuna Islands","Oceania"]
["Western Sahara","Africa"]
["Yemen","Asia"]
["Zambia","Africa"]
["Zimbabwe","Africa"]

{"sheet":"First_Names","index":2,"n_rows":4954,"n_cols":4,"rows_kept":4954,"cut":false,"hidden":false,"merged":[]}
["Name","Gender","Source: ","https://www2.gov.bc.ca/assets/gov/birth-adoption-death-marriage-and-divorce/statistics-reports/baby-names-trends-f-2023.csv"]
["AADHYA","F",null,"https://www2.gov.bc.ca/assets/gov/birth-adoption-death-marriage-and-divorce/statistics-reports/baby-names-trends-m-2023.csv"]
["AADYA","F"]
["AAHANA","F"]
["AALIYAH","F"]
["AANYA","F"]
["AARNA","F"]
["AARYA","F"]
["AARZA","F"]
["AASHVI","F"]
["ABBEY","F"]
["ABBIE","F"]
["ABBIGAIL","F"]
["ABBY","F"]
["ABBYGAIL","F"]
["ABIGAIL","F"]
["ABIGALE","F"]
["ABIGAYLE","F"]
["ABRIELLE","F"]
["ACACIA","F"]
["ADA","F"]
["ADALINE","F"]
["ADALYN","F"]
["ADALYNN","F"]
["ADDILYN","F"]
["ADDISON","F"]
["ADDISYN","F"]
["ADDYSON","F"]
["ADELA","F"]
["ADELAIDE","F"]
["ADELE","F"]
["ADELINA","F"]
["ADELINE","F"]
["ADELLE","F"]
["ADELYN","F"]
["ADELYNN","F"]
["ADIA","F"]
["ADINA","F"]
["ADISON","F"]
["ADLEY","F"]
["ADRIA","F"]
["ADRIANA","F"]
["ADRIANNA","F"]
["ADRIANNE","F"]
["ADRIENNE","F"]
["AGATHA","F"]
["AGNES","F"]
["AIDA","F"]
["AIDAN","F"]
["AIKAM","F"]
["AIKO","F"]
["AILA","F"]
["AILEEN","F"]
["AILISH","F"]
["AIMEE","F"]
["AINSLEY","F"]
["AIRA","F"]
["AISHA","F"]
["AISLINN","F"]
["AISLYNN","F"]
["AITANA","F"]
["AIYANA","F"]
["AIYANNA","F"]
["AIYLA","F"]
["AIZA","F"]
["AJA","F"]
["AJOONI","F"]
["AJUNI","F"]
["AKASHA","F"]
["AKEMI","F"]
["AKIKO","F"]
["AKIRA","F"]
["ALAIA","F"]
["ALAINA","F"]
["ALANA","F"]
["ALANAH","F"]
["ALANNA","F"]
["ALANNAH","F"]
["ALARA","F"]
["ALAYA","F"]
["ALAYNA","F"]
["ALBA","F"]
["ALBERTA","F"]
["ALEAH","F"]
["ALECIA","F"]
["ALEENA","F"]
["ALEESHA","F"]
["ALEISHA","F"]
["ALENA","F"]
["ALESHA","F"]
["ALESSANDRA","F"]
["ALESSI","F"]
["ALESSIA","F"]
["ALETA","F"]
["ALETHEA","F"]
["ALEX","F"]
["ALEXA","F"]
["ALEXANDRA","F"]
["ALEXANDREA","F"]
["ALEXANDRIA","F"]
["ALEXIA","F"]
["ALEXIS","F"]
["ALEXUS","F"]
["ALI","F"]
["ALIA","F"]
["ALIANA","F"]
["ALICE","F"]
["ALICIA","F"]
["ALIDA","F"]
["ALIESHA","F"]
["ALINA","F"]
["ALISA","F"]
["ALISHA","F"]
["ALISON","F"]
["ALISSA","F"]
["ALITA","F"]
["ALIVIA","F"]
["ALIX","F"]
["ALIYA","F"]
["ALIYAH","F"]
["ALIZA","F"]
["ALLEGRA","F"]
["ALLIE","F"]
["ALLISON","F"]
["ALLY","F"]
["ALLYSA","F"]
["ALLYSHA","F"]
["ALLYSON","F"]
["ALLYSSA","F"]
["ALMA","F"]
["ALORA","F"]
["ALTHEA","F"]
["ALYCIA","F"]
["ALYSA","F"]
["ALYSE","F"]
["ALYSHA","F"]
["ALYSHIA","F"]
["ALYSIA","F"]
["ALYSON","F"]
["ALYSSA","F"]
["ALYSSIA","F"]
["ALYVIA","F"]
["AMAANAT","F"]
["AMAIA","F"]
["AMAIRA","F"]
["AMALIA","F"]
["AMAN","F"]
["AMANAT","F"]
["AMANDA","F"]
["AMANDA-LEE","F"]
["AMANDEEP","F"]
["AMANJOT","F"]
["AMANPREET","F"]
["AMARA","F"]
["AMARAH","F"]
["AMARI","F"]
["AMARIS","F"]
["AMARJIT","F"]
["AMARPREET","F"]
["AMAYA","F"]
["AMAYAH","F"]
["AMAYRA","F"]
["AMBER","F"]
["AMBERLY","F"]
["AMEERA","F"]
["AMELIA","F"]
["AMELIE","F"]
["AMI","F"]
["AMIE","F"]
["AMILA","F"]
["AMINA","F"]
["AMIRA","F"]
["AMIRAH","F"]
["AMISHA","F"]
["AMIYAH","F"]
["AMNEET","F"]
["AMREEN","F"]
["AMRIT","F"]
["AMRITA","F"]
["AMY","F"]
["AMYRA","F"]
["AMÉLIE","F"]
["ANA","F"]
["ANABELLE","F"]
["ANABIA","F"]
["ANAHAT","F"]
["ANAISHA","F"]
["ANAIYA","F"]
["ANANT","F"]
["ANASTASIA","F"]
["ANAYA","F"]
["ANAYAH","F"]
["ANAYAT","F"]
["ANAÏS","F"]
["ANDI","F"]
["ANDIE","F"]
["ANDREA","F"]
["ANDRIA","F"]
["ANEET","F"]
["ANGEL","F"]
["ANGELA","F"]
["ANGELENE","F"]
["ANGELICA","F"]
["ANGELINA","F"]
["ANGELINE","F"]
["ANGELIQUE","F"]
["ANGIE","F"]
["ANHAD","F"]
["ANICA","F"]
["ANIKA","F"]
["ANISA","F"]
["ANISHA","F"]
["ANITA","F"]
["ANIYA","F"]
["ANIYAH","F"]
["ANJA","F"]
["ANJALI","F"]
["ANMOL","F"]
["ANN","F"]
["ANN-MARIE","F"]
["ANNA","F"]
["ANNA-MARIE","F"]
["ANNABEL","F"]
["ANNABELLA","F"]
["ANNABELLE","F"]
["ANNALISE","F"]
["ANNAMARIE","F"]
["ANNE","F"]
["ANNE-MARIE","F"]
["ANNEKE","F"]
["ANNELIESE","F"]
["ANNELISE","F"]
["ANNETTE","F"]
["ANNIE","F"]
["ANNIKA","F"]
["ANOUK","F"]
["ANTHEA","F"]
["ANTOINETTE","F"]
["ANTONELLA","F"]
["ANTONIA","F"]
["ANTONIETTA","F"]
["ANUREET","F"]
["ANYA","F"]
["AOIFE","F"]
["APRIL","F"]
["ARA","F"]
["ARABELLA","F"]
["ARAYA","F"]
["ARDEN","F"]
["ARI","F"]
["ARIA","F"]
["ARIADNE","F"]
["ARIAH","F"]
["ARIANA","F"]
["ARIANNA","F"]
["ARIANNE","F"]
["ARIEL","F"]
["ARIELLA","F"]
["ARIELLE","F"]
["ARIN","F"]
["ARINA","F"]
["ARIYA","F"]
["ARIYAH","F"]
["ARLEEN","F"]
["ARLENE","F"]
["ARLINE","F"]
["ARLO","F"]
["ARNAAZ","F"]
["ARSHPREET","F"]
["ARTEMIS","F"]
["ARWEN","F"]
["ARYA","F"]
["ARYANA","F"]
["ARYANNA","F"]
["ARZOE","F"]
["ARZOI","F"]
["ARZOIE","F"]
["ARZOYI","F"]
["ASAKO","F"]
["ASEEL","F"]
["ASEES","F"]
["ASHA","F"]
["ASHANTI","F"]
["ASHLEA","F"]
["ASHLEE","F"]
["ASHLEEN","F"]
["ASHLEIGH","F"]
["ASHLEY","F"]
["ASHLIE","F"]
["ASHLIN","F"]
["ASHLY","F"]
["ASHLYN","F"]
["ASHLYNN","F"]
["ASHTON","F"]
["ASIA","F"]
["ASPEN","F"]
["ASPYN","F"]
["ASTRID","F"]
["ATHENA","F"]
["AUBREE","F"]
["AUBREY","F"]
["AUBRIE","F"]
["AUDRA","F"]
["AUDREY","F"]
["AUDRINA","F"]
["AUDRY","F"]
["AUGUST","F"]
["AURA","F"]
["AURELIA","F"]
["AURORA","F"]
["AUSTIN","F"]
["AUSTYN","F"]
["AUTUMN","F"]
["AVA","F"]
["AVA-MARIE","F"]
["AVAANI","F"]
["AVAH","F"]
["AVALON","F"]
["AVALYN","F"]
["AVALYNN","F"]
["AVANI","F"]
["AVARY","F"]
["AVAYA","F"]
["AVEERA","F"]
["AVELINE","F"]
["AVELYN","F"]
["AVEN","F"]
["AVERI","F"]
["AVERIE","F"]
["AVERY","F"]
["AVIA","F"]
["AVIANA","F"]
["AVIANNA","F"]
["AVIRA","F"]
["AVLEEN","F"]
["AVNEET","F"]
["AVNI","F"]
["AVNOOR","F"]
["AVREEN","F"]
["AVREET","F"]
["AVRIL","F"]
["AVYANNA","F"]
["AYA","F"]
["AYAH","F"]
["AYAKO","F"]
["AYANA","F"]
["AYANNA","F"]
["AYAT","F"]
["AYDA","F"]
["AYDEN","F"]
["AYESHA","F"]
["AYLA","F"]
["AYLIN","F"]
["AYNSLEY","F"]
["AYRA","F"]
["AYSHA","F"]
["AYVA","F"]
["AYZAL","F"]
["AYZEL","F"]
["AZALEA","F"]
["BAANI","F"]
["BAILEE","F"]
["BAILEY","F"]
["BALJINDER","F"]
["BALJIT","F"]
["BANI","F"]
["BARBARA","F"]
["BARBARA-ANN","F"]
["BARBRA","F"]
["BARKAT","F"]
["BAYLEE","F"]
["BEATRICE","F"]
["BEATRIX","F"]
["BECKY","F"]
["BELINDA","F"]
["BELLA","F"]
["BELLE","F"]
["BENITA","F"]
["BENTLEY","F"]
["BERKLEY","F"]
["BERNADETTE","F"]
["BERNADINE","F"]
["BERNICE","F"]
["BERTHA","F"]
["BERYL","F"]
["BESSIE","F"]
["BETH","F"]
["BETHANY","F"]
["BETTE","F"]
["BETTINA","F"]
["BETTY","F"]
["BETTY-LOU","F"]
["BEVERLEY","F"]
["BEVERLY","F"]
["BEXLEY","F"]
["BIANCA","F"]
["BILLIE","F"]
["BIRGIT","F"]
["BLAIR","F"]
["BLAIRE","F"]
{"$rows_left_out":4555}
{"sheet":"Gen_Corr_Target_Corr","index":3,"n_rows":19,"n_cols":16,"rows_kept":19,"cut":false,"hidden":false,"merged":[[2,13,2,15],[3,14,3,15]]}
[1,0.8,0.4,0]
[{"$f":"INDEX($A$1:$D$4,COLUMN(),ROW())","v":0.8},1,0.3,-0.2]
[{"$f":"INDEX($A$1:$D$4,COLUMN(),ROW())","v":0.4},{"$f":"INDEX($A$1:$D$4,COLUMN(),ROW())","v":0.3},1,0.1,null,null,null,null,null,null,null,null,null,"Worksheet Formulas"]
[{"$f":"INDEX($A$1:$D$4,COLUMN(),ROW())","v":0},{"$f":"INDEX($A$1:$D$4,COLUMN(),ROW())","v":-0.2},{"$f":"INDEX($A$1:$D$4,COLUMN(),ROW())","v":0.1},1,null,null,null,null,null,null,null,null,null,"Range","Formula"]
[null,null,null,null,null,null,null,null,null,null,null,null,null,"A7:D10","A7",{"$f":"sbGetCell(INDIRECT(O5),41)","v":"=CORREL(INDEX(Gen_Corr_Output_Series!$A$1:$D$20,,ROW()-6),INDEX(Gen_Corr_Output_Series!$A$1:$D$20,,COLUMN()))"}]
["Result correlation",null,null,null,null,null,null,null,null,null,null,null,null,"A13","A13",{"$f":"sbGetCell(INDIRECT(O6),41)","v":"=A7 - A1"}]
[{"$f":"CORREL(INDEX(Gen_Corr_Output_Series!$A$1:$D$20,,ROW()-6),INDEX(Gen_Corr_Output_Series!$A$1:$D$20,,COLUMN()))","v":1.0000000000000002},{"$f":"CORREL(INDEX(Gen_Corr_Output_Series!$A$1:$D$20,,ROW()-6),INDEX(Gen_Corr_Output_Series!$A$1:$D$20,,COLUMN()))","v":0.78997566791930784},{"$f":"CORREL(INDEX(Gen_Corr_Output_Series!$A$1:$D$20,,ROW()-6),INDEX(Gen_Corr_Output_Series!$A$1:$D$20,,COLUMN()))","v":0.38534184682552608},{"$f":"CORREL(INDEX(Gen_Corr_Output_Series!$A$1:$D$20,,ROW()-6),INDEX(Gen_Corr_Output_Series!$A$1:$D$20,,COLUMN()))","v":2.4390648211522273E-2},null,null,null,null,null,null,null,null,null,"A19","A19",{"$f":"sbGetCell(INDIRECT(O7),41)","v":"=MAX(ABS(A13:D16))"}]
[{"$f":"CORREL(INDEX(Gen_Corr_Output_Series!$A$1:$D$20,,ROW()-6),INDEX(Gen_Corr_Output_Series!$A$1:$D$20,,COLUMN()))","v":0.78997566791930784},{"$f":"CORREL(INDEX(Gen_Corr_Output_Series!$A$1:$D$20,,ROW()-6),INDEX(Gen_Corr_Output_Series!$A$1:$D$20,,COLUMN()))","v":1},{"$f":"CORREL(INDEX(Gen_Corr_Output_Series!$A$1:$D$20,,ROW()-6),INDEX(Gen_Corr_Output_Series!$A$1:$D$20,,COLUMN()))","v":0.30725633045429923},{"$f":"CORREL(INDEX(Gen_Corr_Output_Series!$A$1:$D$20,,ROW()-6),INDEX(Gen_Corr_Output_Series!$A$1:$D$20,,COLUMN()))","v":-0.19452046011968602}]
[{"$f":"CORREL(INDEX(Gen_Corr_Output_Series!$A$1:$D$20,,ROW()-6),INDEX(Gen_Corr_Output_Series!$A$1:$D$20,,COLUMN()))","v":0.38534184682552608},{"$f":"CORREL(INDEX(Gen_Corr_Output_Series!$A$1:$D$20,,ROW()-6),INDEX(Gen_Corr_Output_Series!$A$1:$D$20,,COLUMN()))","v":0.30725633045429923},{"$f":"CORREL(INDEX(Gen_Corr_Output_Series!$A$1:$D$20,,ROW()-6),INDEX(Gen_Corr_Output_Series!$A$1:$D$20,,COLUMN()))","v":1},{"$f":"CORREL(INDEX(Gen_Corr_Output_Series!$A$1:$D$20,,ROW()-6),INDEX(Gen_Corr_Output_Series!$A$1:$D$20,,COLUMN()))","v":7.3247371925240695E-2},null,"How to generate correlated columns of numbers:"]
[{"$f":"CORREL(INDEX(Gen_Corr_Output_Series!$A$1:$D$20,,ROW()-6),INDEX(Gen_Corr_Output_Series!$A$1:$D$20,,COLUMN()))","v":2.4390648211522273E-2},{"$f":"CORREL(INDEX(Gen_Corr_Output_Series!$A$1:$D$20,,ROW()-6),INDEX(Gen_Corr_Output_Series!$A$1:$D$20,,COLUMN()))","v":-0.19452046011968602},{"$f":"CORREL(INDEX(Gen_Corr_Output_Series!$A$1:$D$20,,ROW()-6),INDEX(Gen_Corr_Output_Series!$A$1:$D$20,,COLUMN()))","v":7.3247371925240695E-2},{"$f":"CORREL(INDEX(Gen_Corr_Output_Series!$A$1:$D$20,,ROW()-6),INDEX(Gen_Corr_Output_Series!$A$1:$D$20,,COLUMN()))","v":1.0000000000000002},null,"1. Enter your input series into sheet Gen_Corr_Input_Series"]
[null,null,null,null,null,"2. Enter the desired target correlation matrix into this sheet, top left corner"]
["Correlation difference",null,null,null,null,"3. Press the button \"Generate correlated data\""]
[{"$f":"A7 - A1","v":0},{"$f":"B7 - B1","v":-1.00243320806922E-2},{"$f":"C7 - C1","v":-1.4658153174473942E-2},{"$f":"D7 - D1","v":2.4390648211522273E-2},null,"Adjust constant CMaxIter in module TestCorrelatedNumbers if necessary"]
[{"$f":"A8 - A2","v":-1.00243320806922E-2},{"$f":"B8 - B2","v":0},{"$f":"C8 - C2","v":7.2563304542992424E-3},{"$f":"D8 - D2","v":5.4795398803139939E-3},null,"Re-press button if your largest absolute error is too high"]
[{"$f":"A9 - A3","v":-1.4658153174473942E-2},{"$f":"B9 - B3","v":7.2563304542992424E-3},{"$f":"C9 - C3","v":0},{"$f":"D9 - D3","v":-2.675262807475931E-2},null,"Finally use correlated numbers in sheet Gen_Corr_Output_Series"]
[{"$f":"A10 - A4","v":2.4390648211522273E-2},{"$f":"B10 - B4","v":5.4795398803139939E-3},{"$f":"C10 - C4","v":-2.675262807475931E-2},{"$f":"D10 - D4","v":0}]
[]
["Largest absolute error"]
[{"$f":"MAX(ABS(A13:D16))","v":2.675262807475931E-2}]

{"sheet":"Gen_Corr_Input_Series","index":4,"n_rows":20,"n_cols":4,"rows_kept":20,"cut":false,"hidden":false,"merged":[]}
[123567,44770,15934,13273]
[126109,45191,16839,15406]
[138713,47453,17233,16706]
[139016,47941,17265,16891]
[152213,49345,17620,18821]
[153224,49420,17859,19569]
[153407,50686,20804,20166]
[155716,52931,21110,20796]
[155780,54010,22728,20968]
[161678,57346,24072,21178]
[161805,57685,25198,23236]
[167447,57698,25393,23375]
[170737,58380,30357,24019]
[171592,60948,30779,24785]
[178881,66972,32634,25000]
[181678,68053,33117,26754]
[184381,70592,35248,27079]
[206940,72243,36656,30136]
[217092,86685,38483,30757]
[240935,87138,39483,35108]

{"sheet":"Gen_Corr_Output_Series","index":5,"n_rows":20,"n_cols":4,"rows_kept":20,"cut":false,"hidden":false,"merged":[]}
[123567,44770,17859,20796]
[126109,45191,15934,23375]
[138713,50686,17620,20968]
[139016,47453,17233,15406]
[152213,49345,35248,30757]
[153224,66972,25198,24019]
[153407,49420,17265,19569]
[155716,52931,38483,23236]
[155780,57685,25393,21178]
[161678,60948,21110,35108]
[161805,57698,36656,16706]
[167447,57346,16839,18821]
[170737,47941,39483,30136]
[171592,58380,20804,26754]
[178881,87138,32634,16891]
[181678,54010,24072,27079]
[184381,68053,33117,13273]
[206940,72243,22728,25000]
[217092,70592,30357,24785]
[240935,86685,30779,20166]